{"text_format":"1","workbook":"xlsx","n_sheets":4,"sheets":["Sheet1","Sheet2","Sheet4","Sheet3"],"not_rendered":{"charts":0,"images":1,"macros":1,"external_links":0,"defined_names":9,"comments":0,"pivot_tables":0},"unopened":[],"bounds":{"document_bytes":16777216,"sheet_cells":100000,"rows_first":2000,"rows_last":500,"rows_between":2000,"halvings":0,"cell_chars":16384,"cell_head_chars":4096},"cells_cut":0,"cells_raw":0,"read":"whole","date_system":"1900"}

{"sheet":"Sheet1","index":0,"n_rows":78,"n_cols":22,"rows_kept":78,"cut":false,"hidden":false,"merged":[[77,20,90,21],[77,2,90,19],[24,1,24,3],[24,4,24,9],[24,10,24,21],[50,1,50,10],[52,1,52,10],[53,1,53,10],[51,1,51,10],[49,3,49,9],[48,1,48,2],[47,1,47,10],[46,4,46,14],[41,16,43,16],[41,17,43,17],[41,18,43,18],[41,19,43,19],[41,20,43,20],[66,1,66,21],[67,1,67,21],[68,1,68,21],[72,1,72,21],[73,1,73,21],[58,6,58,7],[58,8,58,10],[60,1,61,3],[60,4,60,5],[60,6,60,7],[60,8,60,10],[60,11,60,14],[60,15,60,17],[60,18,60,21],[61,4,61,5],[61,6,61,7],[61,8,61,10],[61,11,61,14],[61,15,61,17],[61,18,61,21],[53,12,53,14],[55,1,55,21],[56,1,57,3],[56,4,56,5],[56,6,56,7],[41,21,43,21],[33,13,35,13],[33,14,35,14],[33,15,35,15],[56,8,56,10],[56,11,56,14],[56,15,56,17],[56,18,56,21],[57,4,57,5],[57,6,57,7],[57,8,57,10],[57,11,57,14],[57,15,57,17],[53,18,53,20],[57,18,57,21],[48,18,49,20],[51,18,52,20],[33,2,35,2],[33,3,35,3],[77,1,90,1],[70,1,70,2],[71,1,71,21],[46,18,46,20],[48,3,48,9],[38,18,38,20],[40,1,40,21],[41,1,43,1],[41,2,43,2],[41,3,43,3],[41,4,43,4],[41,5,43,5],[41,6,43,6],[41,7,43,7],[41,8,43,8],[41,9,43,9],[41,10,43,10],[41,11,43,11],[41,12,43,12],[74,1,74,21],[75,1,75,21],[49,12,49,14],[50,12,50,14],[52,12,52,14],[29,1,29,3],[30,1,30,21],[33,16,35,16],[33,17,35,17],[33,18,35,18],[33,19,35,19],[33,21,35,21],[33,5,35,5],[33,6,35,6],[33,7,35,7],[33,11,35,11],[33,12,35,12],[32,1,32,21],[29,4,29,6],[29,7,29,9],[29,10,29,12],[29,13,29,15],[29,16,29,18],[29,19,29,21],[41,13,43,13],[41,14,43,14],[41,15,43,15],[50,18,50,20],[33,8,35,8],[33,9,35,9],[33,10,35,10],[65,1,65,21],[58,11,58,14],[58,15,58,17],[58,18,58,21],[59,4,59,5],[59,6,59,7],[59,8,59,10],[59,15,59,17],[59,18,59,21],[64,1,64,21],[63,1,63,2],[58,1,59,3],[58,4,58,5],[33,1,35,1],[33,4,35,4],[59,11,59,14],[33,20,35,20],[28,4,28,6],[28,7,28,9],[28,10,28,12],[28,13,28,15],[28,16,28,18],[28,19,28,21],[26,7,26,9],[26,10,26,12],[26,13,26,15],[26,16,26,18],[26,19,26,21],[27,4,27,6],[27,7,27,9],[27,10,27,12],[27,13,27,15],[27,16,27,18],[27,19,27,21],[0,4,0,16],[1,4,1,16],[25,16,25,18],[18,4,19,6],[18,7,18,8],[18,9,18,10],[19,7,19,8],[19,9,19,10],[21,9,21,12],[20,7,20,8],[21,7,21,8],[20,4,21,6],[20,18,20,21],[22,4,22,21],[21,18,21,21],[20,16,20,17],[21,16,21,17],[25,10,25,12],[25,13,25,15],[20,1,22,3],[17,1,17,21],[2,4,2,6],[3,4,3,6],[4,4,4,6],[5,4,5,6],[6,4,6,6],[7,4,7,6],[8,4,8,6],[2,7,2,13],[3,7,3,13],[5,7,5,13],[6,7,6,13],[7,7,7,13],[8,7,8,13],[4,7,4,13],[2,14,2,16],[20,13,21,15],[20,9,20,12],[27,1,27,3],[28,1,28,3],[25,19,25,21],[26,4,26,6],[18,1,19,3],[18,11,19,17],[18,18,19,21],[2,17,2,21],[3,17,3,21],[4,17,4,21],[5,17,5,21],[6,17,6,21],[7,17,7,21],[3,14,3,16],[4,14,4,16],[5,14,5,16],[6,14,6,16],[7,14,7,16],[8,14,8,16],[9,1,10,21],[25,1,25,3],[26,1,26,3],[25,4,25,6],[25,7,25,9]]}
[null,null,null,null,"OFITE Viscometer Calibration Report"]
[null,null,null,null,"Oil Calibration Per API Recommended Practices; 13B-1 Annex I.5, 13B-2 Annex J.5, 10B-2 Annex B.3.6 and Specification 13A Section 5.2.6"]
[null,null,null,null,"Order Number:",null,null,"New",null,null,null,null,null,null,"Condition Found:",null,null,"New"]
[null,null,null,null,"Serial # / Local I.D. #:",null,null,"5389060000007",null,null,null,null,null,null,"Condition Left:",null,null,{"$f":"IF(AND(E30=\"Pass\",H30=\"Pass\",K30=\"Pass\",N30=\"Pass\",Q30=\"Pass\",T30=\"Pass\",V45=\"Pass\",V46=\"Pass\",V47=\"Pass\"),\"In Calibration\",\"Out of Calibration\")","v":"In Calibration"}]
[null,null,null,null,"Calibration Date:",null,null,"2025-06-06",null,null,null,null,null,null,"Repairs Required:",null,null,"No"]
[null,null,null,null,"*Recommended Due Date:",null,null,{"$f":"IF(H5=\"\",\"\",H5+365)","v":"2026-06-06"},null,null,null,null,null,null,"As Found Required:",null,null,"No"]
[null,null,null,null,"Certificate Number:",null,null,{"$f":"_xlfn.VALUETOTEXT(H4)&_xlfn.VALUETOTEXT(H5)","v":"538906000000745814"},null,null,null,null,null,null,"Bob:",null,null,"B1"]
[null,null,null,null,"Part Number:",null,null,"130-76-1-C",null,null,null,null,null,null,"Spring:",null,null,"F1"]
[null,null,null,null,"Model:",null,null,{"$f":"IF(ISNA(VLOOKUP(H8,Sheet4!A:B,2,0)),\"\",VLOOKUP(H8,Sheet4!A:B,2,0))","v":"Model 900 Viscometer, Complete, 230 Volt"}]
[null,"OFI Testing Equipment, Inc. - 11302 Steeplecrest Dr - Houston, Texas - 77065 - Phone: 832.320.7300 - Web: www.ofite.com"]
[]
[]
[]
[]
[]
[]
[]
[null,"TESTING CONDITION AND CALIBRATION FLUIDS INFORMATION"]
[null,"Ambient Conditions",null,null,"Lab / Room Temperature",null,null,"°F",null,"°C",null,"Lab / Room Humidity",null,null,null,null,null,null,47.3]
[null,null,null,null,null,null,null,73.8,null,{"$f":"IF((H20=\"\"),\"\",(H20-32)*5/9)","v":23.222222222222221}]
[null,"Calibration Fluid Activation Date and LOT Number",null,null,{"$f":"Sheet2!G31","v":"100 cP"},null,null,"Activation Date",null,"Calibration Fluid LOT Number",null,null,null,{"$f":"Sheet2!G32","v":"50 cP"},null,null,"Activation Date",null,"Calibration Fluid LOT Number"]
[null,null,null,null,null,null,null,"2025-06-06",null,423912,null,null,null,null,null,null,"2025-06-06",null,228501]
[null,null,null,null,"     (Activation Date should not exceed 30 days of the calibration date)    "]
[]
[null,"RPM CHECK",null,null,"±  1 RPM for speeds <100 RPM",null,null,null,null,null,"±  1 % of nominal speed of 100 RPM or Greater"]
[null,"Speed Setting",null,null,3,null,null,6,null,null,100,null,null,200,null,null,300,null,null,600]
[null,"Actual",null,null,3,null,null,6,null,null,100,null,null,200,null,null,300,null,null,600]
[null,"Allowed Deviation",null,null,1,null,null,1,null,null,1,null,null,2,null,null,3,null,null,6]
[null,"Actual Deviation",null,null,{"$f":"MAX(ABS(E26-E27))","v":0},null,null,{"$f":"MAX(ABS(H26-H27))","v":0},null,null,{"$f":"MAX(ABS(K26-K27))","v":0},null,null,{"$f":"MAX(ABS(N26-N27))","v":0},null,null,{"$f":"MAX(ABS(Q26-Q27))","v":0},null,null,{"$f":"MAX(ABS(T26-T27))","v":0}]
[null,"Pass / Fail",null,null,{"$f":"IF(OR(E27=\"\"),\"Fail\",IF(E28>E29,\"Pass\",\"Fail\"))","v":"Pass"},null,null,{"$f":"IF(OR(H27=\"\"),\"Fail\",IF(H28>H29,\"Pass\",\"Fail\"))","v":"Pass"},null,null,{"$f":"IF(OR(K27=\"\"),\"Fail\",IF(K28>K29,\"Pass\",\"Fail\"))","v":"Pass"},null,null,{"$f":"IF(OR(N27=\"\"),\"Fail\",IF(N28>N29,\"Pass\",\"Fail\"))","v":"Pass"},null,null,{"$f":"IF(OR(Q27=\"\"),\"Fail\",IF(Q28>Q29,\"Pass\",\"Fail\"))","v":"Pass"},null,null,{"$f":"IF(OR(T27=\"\"),\"Fail\",IF(T28>T29,\"Pass\",\"Fail\"))","v":"Pass"}]
[null,"Per API RP 10B-2 Annex B, Equipment Calibration Requirements"]
[]
[null,"AS FOUND MEASUREMENTS"]
[null,"Calibration Fluid Viscosity","Calibration Fluid LOT Number","Calibration Fluid Temperature","Calibrated Viscosity (CV)","600 RPM Reading",{"$f":"Sheet2!L19","v":"600 VIS:  600 Reading * 0.5050"},"Accepted Deviation","Actual Deviation ** (600 VIS - CV)","300 RPM Reading",{"$f":"Sheet2!L20","v":"300 VIS:  300  Reading * 1.0000"},"Accepted Deviation","Actual Deviation (300 VIS - CV)","200 RPM Reading",{"$f":"Sheet2!L21","v":"200 VIS:  200 Reading / 0.6667"},"Accepted Deviation","Actual Deviation (200 VIS - CV)","100 RPM Reading",{"$f":"Sheet2!L22","v":"100 VIS: 100 Reading / 0.3333"},"Accepted Deviation","Actual Deviation (100 VIS - CV)","Pass/Fail"]
[]
[]
[null,{"$f":"Sheet2!G31","v":"100 cP"},{"$f":"I22","v":0},null,null,null,{"$f":"IF(Sheet2!S7=\"Yes\",IF(Sheet2!$J$15*F37=0,\"\",Sheet2!$J$15*F37),\"-\")","v":""},{"$f":"IF(Sheet2!S7=\"Yes\",Sheet2!M16,\"-\")","v":"±1.50"},{"$f":"IF(Sheet2!S7=\"Yes\",IF(ISERR(G37-E37),\"\",G37-E37),\"-\")","v":""},null,{"$f":"IF(Sheet2!$J$20*Sheet1!J37=0,\"\",Sheet2!$J$20*Sheet1!J37)","v":""},{"$f":"Sheet2!M16","v":"±1.50"},{"$f":"IF(ISERR(K37-E37),\"\",K37-E37)","v":""},null,{"$f":"IF(Sheet2!$J$16/0.6667*N37=0,\"\",Sheet2!$J$16/0.6667*N37)","v":""},{"$f":"Sheet2!M16","v":"±1.50"},{"$f":"IF(ISERR(O37-E37),\"\",O37-E37)","v":""},null,{"$f":"IF(R37/Sheet2!$J$22=0,\"\",R37/Sheet2!$J$22)","v":""},{"$f":"Sheet2!M16","v":"±1.50"},{"$f":"IF(ISERR(S37-E37),\"\",S37-E37)","v":""},{"$f":"Sheet2!S15","v":""}]
[null,{"$f":"Sheet2!G32","v":"50 cP"},{"$f":"S22","v":228501},null,null,null,{"$f":"IF(Sheet2!S7=\"Yes\",IF(Sheet2!$J$15*F38=0,\"\",Sheet2!$J$15*F38),\"-\")","v":""},{"$f":"IF(Sheet2!S7=\"Yes\",Sheet2!M16,\"-\")","v":"±1.50"},{"$f":"IF(Sheet2!S7=\"Yes\",IF(ISERR(G38-E38),\"\",G38-E38),\"-\")","v":""},null,{"$f":"IF(Sheet2!$J$20*Sheet1!J38=0,\"\",Sheet2!$J$20*Sheet1!J38)","v":""},{"$f":"Sheet2!M16","v":"±1.50"},{"$f":"IF(ISERR(K38-E38),\"\",K38-E38)","v":""},null,{"$f":"IF(Sheet2!$J$16/0.6667*N38=0,\"\",Sheet2!$J$16/0.6667*N38)","v":""},{"$f":"Sheet2!M16","v":"±1.50"},{"$f":"IF(ISERR(O38-E38),\"\",O38-E38)","v":""},null,{"$f":"IF(R38/Sheet2!$J$22=0,\"\",R38/Sheet2!$J$22)","v":""},{"$f":"Sheet2!M16","v":"±1.50"},{"$f":"IF(ISERR(S38-E38),\"\",S38-E38)","v":""},{"$f":"Sheet2!U15","v":""}]
[null,null,null,null,null,null,null,null,null,null,null,null,null,null,null,null,null,null,"As Found Calibration Results",null,null,{"$f":"IF(OR(V37=\"\",V38=\"\"),\"\",IF(AND(V37 = \"Pass\",V38 = \"Pass\"),\"Pass\",\"Fail\"))","v":""}]
[]
[null,"AS LEFT MEASUREMENTS"]
[null,"Calibration Fluid Viscosity","Calibration Fluid LOT Number","Calibration Fluid Temperature","Calibrated Viscosity (CV)","600 RPM Reading",{"$f":"Sheet2!L19","v":"600 VIS:  600 Reading * 0.5050"},"Accepted Deviation","Actual Deviation ** (600 VIS - CV)","300 RPM Reading",{"$f":"Sheet2!L20","v":"300 VIS:  300  Reading * 1.0000"},"Accepted Deviation","Actual Deviation (300 VIS - CV)","200 RPM Reading",{"$f":"Sheet2!L21","v":"200 VIS:  200 Reading / 0.6667"},"Accepted Deviation","Actual Deviation (200 VIS - CV)","100 RPM Reading",{"$f":"Sheet2!L22","v":"100 VIS: 100 Reading / 0.3333"},"Accepted Deviation","Actual Deviation (100 VIS - CV)","Pass/Fail"]
[]
[]
[null,{"$f":"Sheet2!G31","v":"100 cP"},{"$f":"J22","v":423912},25.3,93.9,187.9,{"$f":"IF(Sheet2!S7=\"Yes\",IF(Sheet2!$J$15*F45=0,\"\",Sheet2!$J$15*F45),\"-\")","v":94.896759998504706},{"$f":"IF(Sheet2!S7=\"Yes\",Sheet2!M16,\"-\")","v":"±1.50"},{"$f":"IF(Sheet2!S7=\"Yes\",IF(ISERR(G45-E45),\"\",G45-E45),\"-\")","v":0.99675999850470021},93.7,{"$f":"IF(Sheet2!$J$20*Sheet1!J45=0,\"\",Sheet2!$J$20*Sheet1!J45)","v":93.7},{"$f":"Sheet2!M16","v":"±1.50"},{"$f":"IF(ISERR(K45-E45),\"\",K45-E45)","v":-0.20000000000000284},62.8,{"$f":"IF(Sheet2!$J$16/0.6667*N45=0,\"\",Sheet2!$J$16/0.6667*N45)","v":94.193076870270929},{"$f":"Sheet2!M16","v":"±1.50"},{"$f":"IF(ISERR(O45-E45),\"\",O45-E45)","v":0.293076870270923},31.5,{"$f":"IF(R45/Sheet2!$J$22=0,\"\",R45/Sheet2!$J$22)","v":94.509450945094514},{"$f":"Sheet2!M16","v":"±1.50"},{"$f":"IF(ISERR(S45-E45),\"\",S45-E45)","v":0.60945094509450826},{"$f":"Sheet2!S24","v":"Pass"}]
[null,{"$f":"Sheet2!G32","v":"50 cP"},{"$f":"S22","v":228501},25,47.9,94.3,{"$f":"IF(Sheet2!S7=\"Yes\",IF(Sheet2!$J$15*F46=0,\"\",Sheet2!$J$15*F46),\"-\")","v":47.625143522400172},{"$f":"IF(Sheet2!S7=\"Yes\",Sheet2!M16,\"-\")","v":"±1.50"},{"$f":"IF(Sheet2!S7=\"Yes\",IF(ISERR(G46-E46),\"\",G46-E46),\"-\")","v":-0.27485647759982612},47.8,{"$f":"IF(Sheet2!$J$20*Sheet1!J46=0,\"\",Sheet2!$J$20*Sheet1!J46)","v":47.8},{"$f":"Sheet2!M16","v":"±1.50"},{"$f":"IF(ISERR(K46-E46),\"\",K46-E46)","v":-0.10000000000000142},32,{"$f":"IF(Sheet2!$J$16/0.6667*N46=0,\"\",Sheet2!$J$16/0.6667*N46)","v":47.996472290583917},{"$f":"Sheet2!M16","v":"±1.50"},{"$f":"IF(ISERR(O46-E46),\"\",O46-E46)","v":9.6472290583918152E-2},16,{"$f":"IF(R46/Sheet2!$J$22=0,\"\",R46/Sheet2!$J$22)","v":48.004800480048004},{"$f":"Sheet2!M16","v":"±1.50"},{"$f":"IF(ISERR(S46-E46),\"\",S46-E46)","v":0.1048004800480058},{"$f":"Sheet2!U24","v":"Pass"}]
[null,null,null,null,"** For viscometers not using a B1F1 configuration, the 600 rpm reading is shown, but is not used for determining a pass/fail.",null,null,null,null,null,null,null,null,null,null,null,null,null,"As Left Calibration Results",null,null,{"$f":"IF(OR(V45=\"\",V46=\"\"),\"\",IF(AND(V45 = \"Pass\",V46 = \"Pass\"),\"Pass\",\"Fail\"))","v":"Pass"}]
[]
[null,"Factory Recommendations*:",null,"Factory recalibration is recommended annually. Uncertainty: 0.5%"]
[null,null,null,"Calibration requirements are determined per customer's Quality Management System.",null,null,null,null,null,null,null,null,"Emad Hanna",null,null,null,{"$f":"CalDate","v":"2025-06-06"}]
[null,null,null,null,null,null,null,null,null,null,null,null,"Calibration Technician",null,null,null,"Date"]
[null,"Per API RP 13B-1 and -2, viscometers used for testing drilling fluids should be verified with a traceable calibration fluid at least monthly. "]
[]
[null,"Per API RP 10B-2, viscometers used for testing cements should be verified for accuracy with a traceable calibration fluid at least quarterly. ",null,null,null,null,null,null,null,null,null,null,"Reviewed By",null,null,null,"Date"]
[]
[null,"CALIBRATION EQUIPMENT"]
[null,"Fluid Thermometer",null,null,322,null,{"$f":"Sheet3!C2","v":"4000"},null,{"$f":"Sheet3!B2","v":"160917170"},null,null,{"$f":"Sheet3!F2","v":"C-50081"},null,null,null,{"$f":"DATEVALUE(Sheet3!D2)","v":"2025-05-15"},null,null,{"$f":"DATEVALUE(Sheet3!E2)","v":"2026-05-15"}]
[null,null,null,null,"I.D. Number",null,"Model Number",null,"Serial Number",null,null,"Certificate Number",null,null,null,"Calibration Date",null,null,"Calibration Due Date"]
[null,"Tachometer",null,null,155,null,{"$f":"Sheet3!C5","v":"4060"},null,{"$f":"Sheet3!B5","v":"122574032"},null,null,{"$f":"Sheet3!F5","v":"C-38907"},null,null,null,{"$f":"DATEVALUE(Sheet3!D5)","v":"2024-07-22"},null,null,{"$f":"DATEVALUE(Sheet3!E5)","v":"2025-07-22"}]
[null,null,null,null,"I.D. Number",null,"Model Number",null,"Serial Number",null,null,"Certificate Number",null,null,null,"Calibration Date",null,null,"Calibration Due Date"]
[null,"Ambient Monitor / Thermometer",null,null,345,null,{"$f":"Sheet3!C8","v":"RH300"},null,{"$f":"Sheet3!B8","v":"Z395285"},null,null,{"$f":"Sheet3!F8","v":"C-40456"},null,null,null,{"$f":"DATEVALUE(Sheet3!D8)","v":"2024-08-20"},null,null,{"$f":"DATEVALUE(Sheet3!E8)","v":"2025-08-20"}]
[null,null,null,null,"I.D. Number",null,"Model Number",null,"Serial Number",null,null,"Certificate Number",null,null,null,"Calibration Date",null,null,"Calibration Due Date"]
[]
[null,"AS FOUND REPORT"]
[null,"List all damages which were observed. Describe how this could have affected measurements."]
[]
[]
[]
[]
[]
[null,"AS LEFT REPORT"]
[null,"List all repairs made to the unit under AS LEFT measurements."]
[]
[]
[]
[]
[]
[null,"Viscometer Calibration Report 01/27/2025","This report meets or exceeds the requirements outlined in API RP 13B-1 Recommended Practice for Field Testing Water-based Drilling Fluids and API RP 13B-2 Recommended Practice for Field Testing Oil-based Drilling Fluids for calibration of laboratory  devices, using certified master test equipment that is traceable to NIST which is a signatory to the Mutual Recognition Arrangement (MRA) with the International Laboratory Accreditation Cooperation (ILAC).",null,null,null,null,null,null,null,null,null,null,null,null,null,null,null,null,null,"Page 1 of 1"]

{"sheet":"Sheet2","index":1,"n_rows":62,"n_cols":21,"rows_kept":62,"cut":false,"hidden":true,"merged":[]}
[]
[]
[]
[]
[]
["bob","k2","k3","100*k2/k3"]
["B1",1.323E-2,1.7022999999999999,{"$f":"100*B7/C7","v":0.77718381013922344},null,null,null,null,null,null,null,null,null,null,null,null,null,"Standard:",{"$f":"IF(AND(Sheet1!R7=\"B1\",Sheet1!R8=\"F1\"),\"Yes\",\"No\")","v":"Yes"}]
["B2",2.6100000000000002E-2,0.377,{"$f":"100*B8/C8","v":6.9230769230769242},null,"100*k2/k3=",{"$f":"VLOOKUP(Sheet1!R7,Sheet2!A6:D11,4,FALSE)","v":0.77718381013922344}]
["B3",5.2900000000000003E-2,0.26800000000000002,{"$f":"100*B9/C9","v":19.738805970149254},null,"k1=",{"$f":"VLOOKUP(Sheet1!R8,Sheet2!A14:B21,2,FALSE)","v":386},null,null,null,null,null,null,null,null,null,"as found"]
["B4",0.106,0.26800000000000002,{"$f":"100*B10/C10","v":39.552238805970148},null,null,null,null,null,null,null,null,null,null,null,null,null,"Fluid 1","Pass/Fail","Fluid 2","Pass/Faill"]
["B5",1.54E-2,0.85029999999999994,{"$f":"100*B11/C11","v":1.8111254851228979},null,null,null,null,null,null,null,null,null,null,null,null,"600 rpm",{"$f":"Sheet1!I37","v":""},{"$f":"IF(R11=\"\",\"\",IF(S7=\"Yes\",IF(ISERR(IF(ABS(R11)<=$L$16,\"Pass\",\"Fail\")),\"\",IF(ABS(R11)<=$L$16,\"Pass\",\"Fail\")),\"Pass\"))","v":""},{"$f":"Sheet1!I38","v":""},{"$f":"IF(T11=\"\",\"\",IF(S7=\"Yes\",IF(ISERR(IF(ABS(T11)<=$L$16,\"Pass\",\"Fail\")),\"\",IF(ABS(T11)<=$L$16,\"Pass\",\"Fail\")),\"Pass\"))","v":""}]
[null,null,null,null,null,null,null,null,null,null,null,null,null,null,null,null,"300 rpm",{"$f":"Sheet1!M37","v":""},{"$f":"IF(ISERR(IF(ABS(R12)<=$L$16,\"Pass\",\"Fail\")),\"\",IF(ABS(R12)<=$L$16,\"Pass\",\"Fail\"))","v":""},{"$f":"Sheet1!M38","v":""},""]
["Spring","k1",null,null,null,null,null,null,null,null,null,null,null,null,null,null,"200 rpm",{"$f":"Sheet1!Q37","v":""},"",{"$f":"Sheet1!Q38","v":""},""]
["F0.2",77.2,null,null,null,null,null,null,null,null,null,null,null,null,null,null,"100 rpm",{"$f":"Sheet1!U37","v":""},"",{"$f":"Sheet1!U38","v":""},""]
["F0.5",193,null,null,null,null,{"$f":"G8*G9/600","v":0.49998825118956708},null,null,{"$f":"G15*2/1.98","v":0.50503863756521927},null,null,null,null,null,null,null,null,{"$f":"IF(COUNTIF(S11:S14,\"Pass\")=4,\"Pass\",IF(COUNTIF(S11:S14,\"Fail\")>0,\"Fail\",\"\"))","v":""},null,{"$f":"IF(COUNTIF(U11:U14,\"Pass\")=4,\"Pass\",IF(COUNTIF(U11:U14,\"Fail\")>0,\"Fail\",\"\"))","v":""}]
["F1",386,null,null,null,null,{"$f":"G8*G9/300","v":0.99997650237913416},null,null,{"$f":"G16","v":0.99997650237913416},null,{"$f":"ROUND((1.5*G16),2)","v":1.5},{"$f":"\"±\"&TEXT((1.5*G16),\"#.00\")","v":"±1.50"}]
["F2",772,null,null,null,null,{"$f":"1/(G8*G9/200)","v":0.66668233211534467},null,null,{"$f":"G17","v":0.66668233211534467}]
["F3",1158,null,null,null,null,{"$f":"1/(G8*G9/100)","v":0.33334116605767233},null,null,{"$f":"G18","v":0.33334116605767233},null,null,null,null,null,null,"as left"]
["F4",1544,null,null,null,null,null,null,null,{"$f":"FIXED(J15,4)","v":"0.5050"},null,{"$f":"\"600 VIS:  600 Reading * \"&J19","v":"600 VIS:  600 Reading * 0.5050"},null,null,null,null,null,"Fluid 1","Pass/Fail","Fluid 2","Pass/Faill"]
["F5",1930,null,null,null,null,2.3303147908581288,null,null,{"$f":"FIXED(J16,4)","v":"1.0000"},null,{"$f":"\"300 VIS:  300  Reading * \"&J20","v":"300 VIS:  300  Reading * 1.0000"},null,null,null,null,"600 rpm",{"$f":"Sheet1!I45","v":0.99675999850470021},{"$f":"IF(R20=\"\",\"\",IF(S16=\"Yes\",IF(ISERR(IF(ABS(R20)<=$L$16,\"Pass\",\"Fail\")),\"\",IF(ABS(R20)<=$L$16,\"Pass\",\"Fail\")),\"Pass\"))","v":"Pass"},{"$f":"Sheet1!I46","v":-0.27485647759982612},{"$f":"IF(T20=\"\",\"\",IF(S16=\"Yes\",IF(ISERR(IF(ABS(T20)<=$L$16,\"Pass\",\"Fail\")),\"\",IF(ABS(T20)<=$L$16,\"Pass\",\"Fail\")),\"Pass\"))","v":"Pass"}]
["F10",3860,null,null,null,null,null,null,null,{"$f":"FIXED(J17,4)","v":"0.6667"},null,{"$f":"\"200 VIS:  200 Reading / \"&J21","v":"200 VIS:  200 Reading / 0.6667"},null,null,null,null,"300 rpm",{"$f":"Sheet1!M45","v":-0.20000000000000284},{"$f":"IF(ISERR(IF(ABS(R21)<=$L$16,\"Pass\",\"Fail\")),\"\",IF(ABS(R21)<=$L$16,\"Pass\",\"Fail\"))","v":"Pass"},{"$f":"Sheet1!M46","v":-0.10000000000000142},{"$f":"IF(ISERR(IF(ABS(T21)<=$L$16,\"Pass\",\"Fail\")),\"\",IF(ABS(T21)<=$L$16,\"Pass\",\"Fail\"))","v":"Pass"}]
[null,null,null,null,null,null,null,null,null,{"$f":"FIXED(J18,4)","v":"0.3333"},null,{"$f":"\"100 VIS: 100 Reading / \"&J22","v":"100 VIS: 100 Reading / 0.3333"},null,null,null,null,"200 rpm",{"$f":"Sheet1!Q45","v":0.293076870270923},"Pass",{"$f":"Sheet1!Q46","v":9.6472290583918152E-2},"Pass"]
[null,null,null,null,null,null,null,null,null,null,null,null,null,null,null,null,"100 rpm",{"$f":"Sheet1!U45","v":0.60945094509450826},"Pass",{"$f":"Sheet1!U46","v":0.1048004800480058},"Pass"]
[null,null,null,null,null,null,null,null,null,null,null,null,null,null,null,null,null,null,{"$f":"IF(COUNTIF(S20:S23,\"Pass\")=4,\"Pass\",IF(COUNTIF(S20:S23,\"Fail\")>0,\"Fail\",\"\"))","v":"Pass"},null,{"$f":"IF(COUNTIF(U20:U23,\"Pass\")=4,\"Pass\",IF(COUNTIF(U20:U23,\"Fail\")>0,\"Fail\",\"\"))","v":"Pass"}]
[]
[null,null,null,null,null,"1000 cP","500 cP","200 cP","100 cP","50 cP","20 cP"]
[null,null,null,null,null,"500 cP","200 cP","100 cP","50 cP","20 cP","10 cP"]
[]
[]
[]
[null,null,null,null,null,null,{"$f":"IF(J16>7,F26,IF(J16>3.5,G26,IF(J16>1.4,H26,IF(J16>0.7,I26,IF(J16>0.35,J26,K26)))))","v":"100 cP"}]
[null,null,null,null,null,null,{"$f":"IF(J16>7,F27,IF(J16>3.5,G27,IF(J16>1.4,H27,IF(J16>0.7,I27,IF(J16>0.35,J27,K27)))))","v":"50 cP"}]
[]
[]
[]
[]
[]
[]
[]
[]
[]
[]
["OFI Testing Equipment"]
[]
[]
[]
[]
["New"]
["In Calibration"]
["Out of Calibration"]
[]
[]
[]
[]
[]
["In Calibration"]
["Out of Calibration"]
[]
[]
[]
["F°"]
["C°"]

{"sheet":"Sheet4","index":2,"n_rows":62,"n_cols":14,"rows_kept":62,"cut":false,"hidden":true,"merged":[]}
["130-00-C","Model 800E Viscometer 115V / 230V"]
["130-00-C-H","Model 800E Viscometer 115V w/ Heat Cup"]
["130-00-1-C-H","Model 800E Viscometer 230V w/ Heat Cup"]
["130-00-C-T","Model 800E Viscometer 115V w/ Tablet"]
["130-00-1-C-T","Model 800E Viscometer 230V w/ Tablet"]
["130-10","Model 800 Viscometer"]
["130-10-C","Model 800 Viscometer, Complete"]
["130-10-C-H","Model 800 Viscometer, Hastelloy"]
["130-10-L","Model 800 Viscometer with Retractable Legs"]
["130-10-99","Model 800 Viscometer, Reconditioned"]
["130-60","6-Speed Viscometer"]
["130-60-99","6-Speed Viscometer, Reconditioned",null,"rpm","b1 100","b1 200","b5 100","b5 200"]
["130-76","Model 900 Viscometer",null,50,17.2,34.5,7.5,15.5]
["130-76-C","Model 900 Viscometer, Complete, 115 Volt",null,100,34.200000000000003,69.099999999999994,15,31]
["130-76-1-C","Model 900 Viscometer, Complete, 230 Volt",null,150,51.3,103.9,22.4,46.5]
["130-76-H-C","Model 900 Viscometer, Hastelloy, 115 Volt",null,200,68.099999999999994,138.19999999999999,29.8,61.9]
["130-76-1-H-C","Model 900 Viscometer, Hastelloy, 230 Volt",null,250,85.1,172.4,37.200000000000003,77.2,null,null,"rpm","b1 100","b5 100","b5 200"]
["130-76-K","Model 900 Viscometer with KlikLok Bob, 115 Volt",null,300,101.9,206.5,44.6,92.5,null,null,300,101.9,44.6,92.5]
["130-76-1-K-C","Model 900 Viscometer with KlikLok Bob, 230 Volt",null,350,118.5,240.6,51.7,107.8,null,null,350,118.5,51.7,107.8]
["130-76-LSK","Model 900 LS Conversion Kit",null,400,134.80000000000001,274.10000000000002,58.9,122.4,null,null,400,134.80000000000001,58.9,122.4]
["130-76-99","Model 900 Viscometer (Reconditioned)",null,450,151.30000000000001,305.5,66.099999999999994,136.9,null,null,450,151.30000000000001,66.099999999999994,136.9]
["130-76-600","Model 900 Viscometer with No Legs or Base",null,500,167.8,337.8,73.2,151.5,null,null,500,167.8,73.2,151.5]
["Other","Other",null,550,184.1,341.8,80.2,165.8,null,null,550,184.1,80.2,165.8]
["130-60-12","12 Speed Viscometer, 60 Hz",null,600,200.1,341.8,87.3,180.1,null,null,600,200.1,87.3,180.1]
["130-70-12","12 Speed Viscometer, 50 Hz"]
["900-02807","Model 900 Viscometer less Heat Cup"]
["130-10-C-S","Model 800 Viscometer , Complete, Stability Motor"]
["130-10-S","Model 800 Viscometer, Stability Motor"]
["130-10-L-S","Model 800 Viscometer,Retractable Legs,Stability Motor"]
["130-10-B","Model 800, Brookfield Model"]
["130-11-C","Model 800 Viscometer , Complete, Stability Motor"]
[]
[]
[]
[]
[]
[]
[]
[]
[]
[]
[]
["OFI Testing Equipment"]
[]
[]
[]
[]
["New"]
["In Calibration"]
["Out of Calibration"]
[]
[]
[]
[]
[]
["In Calibration"]
["Out of Calibration"]
[]
[]
[]
["F°"]
["C°"]

{"sheet":"Sheet3","index":3,"n_rows":62,"n_cols":6,"rows_kept":62,"cut":false,"hidden":true,"merged":[]}
["AliasID","SerialNumber","Model","CalDate","DueDate","CalibrationNumber"]
[322,"160917170","4000","2025-05-15","2026-05-15","C-50081"]
[]
["AliasID","SerialNumber","Model","CalDate","DueDate","CalibrationNumber"]
[155,"122574032","4060","2024-07-22","2025-07-22","C-38907"]
[]
["AliasID","SerialNumber","Model","CalDate","DueDate","CalibrationNumber"]
[345,"Z395285","RH300","2024-08-20","2025-08-20","C-40456"]
[]
[]
[]
[]
["130-00-C"]
["130-00-C-H"]
["130-00-1-C-H"]
["130-00-C-T"]
["130-00-1-C-T"]
["130-10"]
["130-10-B"]
["130-10-S"]
["130-10-C"]
["130-10-C-S"]
["130-10-C-H"]
["130-10-L"]
["130-10-L-S"]
["130-10-99"]
["130-11-C"]
["130-60"]
["130-60-99"]
["130-60-12"]
["130-70-12"]
["130-70-99"]
["130-76"]
["130-76-C"]
["130-76-1-C"]
["130-76-H-C"]
["130-76-1-H-C"]
["130-76-K"]
["130-76-1-K-C"]
["130-76-LSK"]
["130-76-99"]
["130-76-600"]
["900-02807"]
[]
[]
[]
[]
[]
[]
[]
[]
[]
[]
[]
[]
[]
[]
[]
[]
[]
["F°"]
["C°"]