{"text_format":"1","workbook":"xlsx","n_sheets":4,"sheets":["Sheet1","Sheet2","Sheet3","Sheet4"],"not_rendered":{"charts":0,"images":1,"macros":1,"external_links":0,"defined_names":11,"comments":0,"pivot_tables":0},"unopened":[],"bounds":{"document_bytes":16777216,"sheet_cells":100000,"rows_first":2000,"rows_last":500,"rows_between":2000,"halvings":0,"cell_chars":16384,"cell_head_chars":4096},"cells_cut":0,"cells_raw":0,"read":"whole","date_system":"1900"}

{"sheet":"Sheet1","index":0,"n_rows":64,"n_cols":22,"rows_kept":64,"cut":false,"hidden":false,"merged":[[61,3,61,4],[53,0,53,3],[57,0,57,3],[60,3,60,4],[55,0,55,3],[53,15,53,16],[60,11,60,12],[38,5,38,6],[55,13,55,14],[38,8,38,9],[42,0,42,21],[53,19,53,21],[57,19,57,21],[55,19,55,21],[46,0,46,21],[61,5,61,6],[55,15,55,16],[57,8,57,9],[57,10,57,11],[57,13,57,14],[57,15,57,16],[61,9,61,10],[38,0,38,3],[33,19,33,21],[31,17,31,18],[33,17,33,18],[34,7,34,16],[31,7,31,8],[31,9,31,16],[32,9,32,16],[38,10,38,15],[31,0,31,2],[31,19,31,21],[33,7,33,16],[31,3,31,5],[35,3,35,5],[33,3,33,5],[39,5,39,9],[43,0,43,21],[1,0,1,21],[2,0,2,21],[0,0,0,21],[4,0,4,21],[5,0,5,21],[9,8,9,11],[9,18,9,19],[9,20,9,21],[29,19,29,20],[22,19,22,20],[12,8,12,10],[13,8,13,10],[14,8,14,10],[15,8,15,10],[16,8,16,10],[17,8,17,10],[9,14,9,17],[9,12,9,13],[35,0,35,2],[33,0,33,2],[25,1,25,2],[21,1,21,2],[28,1,28,2],[18,0,18,2],[24,0,24,2],[9,4,9,6],[23,8,23,16],[12,11,12,12],[12,13,12,16],[61,11,61,12],[7,3,7,5],[47,0,47,21],[53,13,53,14],[20,1,20,2],[9,0,9,3],[19,1,19,2],[60,5,60,6],[60,9,60,10],[55,8,55,9],[55,10,55,11],[53,8,53,9],[53,10,53,11],[7,10,7,11],[26,1,26,2],[27,1,27,2]]}
["OFI Testing Equipment, Inc."]
["11302 Steeplecrest Drive    Houston, TX 77065 USA"]
["Phone:  832-320-7300  ·  Fax:  713-880-9886  ·  Web: www.ofite.com"]
[]
["Viscometer Calibration Report"]
["Oil Calibration Per API Recommended Practices; 13B-1 Annex I.5, 13B-2 Annex J.5, 10B-2 Annex B.3.6 and Specification 13A Section 5.2.6"]
[]
[null,null,"Repairs Required?","No",null,null,null,null,null,"As Found Data Required by Customer?","No"]
[]
["Part Number:",null,null,null,"130-76-1-C",null,null,"Model:",{"$f":"IF(ISNA(VLOOKUP(E10,Sheet3!A:B,2,0)),\"\",VLOOKUP(E10,Sheet3!A:B,2,0))","v":"Model 900 Viscometer, Complete, 230 Volt"},null,null,null," Serial Number:",null,"5551230000001",null,null,null,"S/O# or J/O#",null,555123]
[]
[null,null,"Bob","B1",null,"Spring","F1"]
[null,null,null,null,null,null,null,null,"RPM Check",null,null,"±  1 RPM for speeds <100 RPM",null,"±  1 % of nominal speed of 100 RPM or Greater"]
[null,null,null,null,null,null,null,null,"Speed Setting (RPM):",null,null,3,6,100,200,300,600]
[null,null,null,null,null,null,null,null,"Actual:",null,null,3,6,100,200,300,600]
[null,null,null,null,null,null,null,null,"Allowed Deviation:",null,null,1,1,{"$f":"N14*1%","v":1},{"$f":"O14*1%","v":2},{"$f":"P14*1%","v":3},{"$f":"Q14*1%","v":6}]
[null,null,null,null,null,null,null,null,"Actual Deviation:",null,null,{"$f":"MAX(ABS(L14-L15))","v":0},{"$f":"MAX(ABS(M14-M15))","v":0},0,{"$f":"MAX(ABS(O14-O15))","v":0},0,0]
[null,null,null,null,null,null,null,null,"Pass / Fail:",null,null,{"$f":"IF(OR(L15=\"\"),\"Fail\",IF(L16>L17,\"Pass\",\"Fail\"))","v":"Pass"},{"$f":"IF(OR(M15=\"\"),\"Fail\",IF(M16>M17,\"Pass\",\"Fail\"))","v":"Pass"},{"$f":"IF(OR(N15=\"\"),\"Fail\",IF(N16>N17,\"Pass\",\"Fail\"))","v":"Pass"},"Pass","Pass","Pass"]
["AS FOUND MEASUREMENTS"]
["Calibration Fluid Viscosity","Calibration Fluid Batch #",null,"Temp","Calibrated Viscosity (CV)","600 RPM Reading",{"$f":"Sheet2!L19","v":"600 VIS:  600 Reading * 0.5050"},"Accepted Deviation","Actual Deviation (600 VIS - CV)","300 RPM Reading",{"$f":"Sheet2!L20","v":"300 VIS:  300  Reading * 1.0000"},"Accepted Deviation","Actual Deviation (300 VIS - CV)","200 RPM Reading",{"$f":"Sheet2!L21","v":"200 VIS:  200 Reading / 0.6667"},"Accepted Deviation","Actual Deviation (200 VIS - CV)","100 RPM Reading",{"$f":"Sheet2!L22","v":"100 VIS: 100 Reading / 0.3333"},"Accepted Deviation","Actual Deviation (100 VIS - CV)","Pass/Fail"]
[{"$f":"Sheet2!G31","v":"100 cP"},null,null,null,null,null,{"$f":"IF(Sheet2!S7=\"Yes\",IF(Sheet2!$J$15*F21=0,\"\",Sheet2!$J$15*F21),\"-\")","v":""},{"$f":"IF(Sheet2!S7=\"Yes\",Sheet2!M16,\"-\")","v":"±1.50"},{"$f":"IF(Sheet2!S7=\"Yes\",IF(ISERR(G21-E21),\"\",G21-E21),\"-\")","v":""},null,{"$f":"IF(Sheet2!$J$20*Sheet1!J21=0,\"\",Sheet2!$J$20*Sheet1!J21)","v":""},{"$f":"Sheet2!M16","v":"±1.50"},{"$f":"IF(ISERR(K21-E21),\"\",K21-E21)","v":""},null,{"$f":"IF(Sheet2!$J$16/0.6667*N21=0,\"\",Sheet2!$J$16/0.6667*N21)","v":""},{"$f":"Sheet2!M16","v":"±1.50"},{"$f":"IF(ISERR(O21-E21),\"\",O21-E21)","v":""},null,{"$f":"IF(R21/Sheet2!$J$22=0,\"\",R21/Sheet2!$J$22)","v":""},{"$f":"Sheet2!M16","v":"±1.50"},{"$f":"IF(ISERR(S21-E21),\"\",S21-E21)","v":""},{"$f":"IF(ISERR(IF(AND(ABS(I21)<=Sheet2!$L$16,ABS(M21)<=Sheet2!$L$16,ABS(Q21)<=Sheet2!$L$16,ABS(U21)<=Sheet2!$L$16),\"Pass\",\"Fail\")),\"\",IF(AND(ABS(I21)<=Sheet2!$L$16,ABS(M21)<=Sheet2!$L$16,ABS(Q21)<=Sheet2!$L$16,ABS(U21)<=Sheet2!$L$16),\"Pass\",\"Fail\"))","v":""}]
[{"$f":"Sheet2!G32","v":"50 cP"},null,null,null,null,null,{"$f":"IF(Sheet2!S7=\"Yes\",IF(Sheet2!$J$15*F22=0,\"\",Sheet2!$J$15*F22),\"-\")","v":""},{"$f":"IF(Sheet2!S7=\"Yes\",Sheet2!M16,\"-\")","v":"±1.50"},{"$f":"IF(Sheet2!S7=\"Yes\",IF(ISERR(G22-E22),\"\",G22-E22),\"-\")","v":""},null,{"$f":"IF(Sheet2!$J$20*Sheet1!J22=0,\"\",Sheet2!$J$20*Sheet1!J22)","v":""},{"$f":"Sheet2!M16","v":"±1.50"},{"$f":"IF(ISERR(K22-E22),\"\",K22-E22)","v":""},null,{"$f":"IF(Sheet2!$J$16/0.6667*N22=0,\"\",Sheet2!$J$16/0.6667*N22)","v":""},{"$f":"Sheet2!M16","v":"±1.50"},{"$f":"IF(ISERR(O22-E22),\"\",O22-E22)","v":""},null,{"$f":"IF(R22/Sheet2!$J$22=0,\"\",R22/Sheet2!$J$22)","v":""},{"$f":"Sheet2!M16","v":"±1.50"},{"$f":"IF(ISERR(S22-E22),\"\",S22-E22)","v":""},{"$f":"IF(ISERR(IF(AND(ABS(I22)<=Sheet2!$L$16,ABS(M22)<=Sheet2!$L$16,ABS(Q22)<=Sheet2!$L$16,ABS(U22)<=Sheet2!$L$16),\"Pass\",\"Fail\")),\"\",IF(AND(ABS(I22)<=Sheet2!$L$16,ABS(M22)<=Sheet2!$L$16,ABS(Q22)<=Sheet2!$L$16,ABS(U22)<=Sheet2!$L$16),\"Pass\",\"Fail\"))","v":""}]
[null,null,null,null,null,null,null,null,null,null,null,null,null,null,null,null,null,null,null,"Calibration Result",null,{"$f":"IF(OR(V21=\"\",V22=\"\"),\"\",IF(AND(V21 = \"Pass\",V22 = \"Pass\"),\"Pass\",\"Fail\"))","v":""}]
[null,null,null,null,null,null,null,null,"Per API RP 10B-2 Annex B, Equipment Calibration Requirements"]
["AS LEFT MEASUREMENTS"]
["C1","C2",null,"C3","C4","C5","C6","C7","C8","C9","C10","C11","C12","C13","C14","C15","C16","C17","C18","C19","C20","C21"]
["Calibration Fluid Viscosity","Calibration Fluid Batch #",null,"Temp","Calibrated Viscosity (CV)","600 RPM Reading",{"$f":"Sheet2!L19","v":"600 VIS:  600 Reading * 0.5050"},"Accepted Deviation","Actual Deviation**","300 RPM Reading",{"$f":"Sheet2!L20","v":"300 VIS:  300  Reading * 1.0000"},"Accepted Deviation","Actual Deviation","200 RPM Reading",{"$f":"Sheet2!L21","v":"200 VIS:  200 Reading / 0.6667"},"Accepted Deviation","Actual Deviation","100 RPM Reading",{"$f":"Sheet2!L22","v":"100 VIS: 100 Reading / 0.3333"},"Accepted Deviation","Actual Deviation (100 VIS - CV)","Pass/Fail"]
[{"$f":"Sheet2!G31","v":"100 cP"},309602,null,25.3,97.4,193.7,{"$f":"IF(Sheet2!S7=\"Yes\",IF(Sheet2!$J$15*F28=0,\"\",Sheet2!$J$15*F28),\"-\")","v":97.825984096382967},{"$f":"IF(Sheet2!S7=\"Yes\",Sheet2!M16,\"-\")","v":"±1.50"},{"$f":"IF(Sheet2!S7=\"Yes\",IF(ISERR(G28-E28),\"\",G28-E28),\"-\")","v":0.42598409638296175},97.3,{"$f":"IF(Sheet2!$J$20*Sheet1!J28=0,\"\",Sheet2!$J$20*Sheet1!J28)","v":97.3},{"$f":"Sheet2!M16","v":"±1.50"},{"$f":"IF(ISERR(K28-E28),\"\",K28-E28)","v":-0.10000000000000853},65.2,{"$f":"IF(Sheet2!$J$16/0.6667*N28=0,\"\",Sheet2!$J$16/0.6667*N28)","v":97.792812292064738},{"$f":"Sheet2!M16","v":"±1.50"},{"$f":"IF(ISERR(O28-E28),\"\",O28-E28)","v":0.39281229206473256},32.5,{"$f":"IF(R28/Sheet2!$J$22=0,\"\",R28/Sheet2!$J$22)","v":97.509750975097518},{"$f":"Sheet2!M16","v":"±1.50"},{"$f":"IF(ISERR(S28-E28),\"\",S28-E28)","v":0.10975097509751208},{"$f":"Sheet2!S15","v":"Pass"}]
[{"$f":"Sheet2!G32","v":"50 cP"},228501,null,24.7,48.2,94.9,{"$f":"IF(Sheet2!S7=\"Yes\",IF(Sheet2!$J$15*F29=0,\"\",Sheet2!$J$15*F29),\"-\")","v":47.928166704939315},{"$f":"IF(Sheet2!S7=\"Yes\",Sheet2!M16,\"-\")","v":"±1.50"},{"$f":"IF(Sheet2!S7=\"Yes\",IF(ISERR(G29-E29),\"\",G29-E29),\"-\")","v":-0.27183329506068787},48,{"$f":"IF(Sheet2!$J$20*Sheet1!J29=0,\"\",Sheet2!$J$20*Sheet1!J29)","v":48},{"$f":"Sheet2!M16","v":"±1.50"},-0.20000000000000284,32.1,{"$f":"IF(Sheet2!$J$16/0.6667*N29=0,\"\",Sheet2!$J$16/0.6667*N29)","v":48.146461266491997},{"$f":"Sheet2!M16","v":"±1.50"},-5.3538733508005976E-2,16.100000000000001,{"$f":"IF(R29/Sheet2!$J$22=0,\"\",R29/Sheet2!$J$22)","v":48.304830483048313},{"$f":"Sheet2!M16","v":"±1.50"},0.10483048304831044,{"$f":"Sheet2!U15","v":"Pass"}]
[null,null,null,null,null,null,null,null,"** For viscometers not using a B1F1 configuration, the 600 rpm reading is shown, but is not used for determining a pass/fail.",null,null,null,null,null,null,null,null,null,null,"Calibration Result",null,{"$f":"IF(OR(V28=\"\",V29=\"\"),\"\",IF(AND(V28 = \"Pass\",V29 = \"Pass\"),\"Pass\",\"Fail\"))","v":"Pass"}]
[]
["Technician:",null,null,"John Doe",null,null,null,"Factory Recommendations*:",null,"Factory recalibration is recommended annually. Uncertainty: 0.5%",null,null,null,null,null,null,null,"Reviewed By:",null,"Jane Doe"]
["  ",null,null,null,null,null,null,null,null,"Calibration requirements are determined per customer's Quality Management System."]
["Calibration Date:",null,null,"2024-07-23",null,null,null,"Per API RP 13B-1 and -2, viscometers used for testing drilling fluids should be verified with a traceable calibration fluid at least monthly. ",null,null,null,null,null,null,null,null,null,"Review Date:     ",null,"2024-07-24"]
[null,null,null,null,null,null,null,"Per API RP 10B-2, viscometers used for testing cements should be verified for accuracy with a traceable calibration fluid at least quarterly. "]
[" Calibration Due Date*:",null,null,{"$f":"IF(D34=\"\",\"\",D34+365)","v":"2025-07-23"}]
[]
["  "]
["Calibration Fluid Activation Date:",null,null,null,{"$f":"Sheet2!G31","v":"100 cP"},"2024-07-21",null,{"$f":"Sheet2!G32","v":"50 cP"},"2024-07-21"]
[null,null,null,null,null,"     (Activation Date should not exceed 30 days of the calibration date)    "]
["As Found Report"]
["List all damages which were observed. Describe how this could have affected measurements."]
[]
[]
[]
["List all repairs made prior to AS LEFT measuremnents."]
[]
[]
[]
[]
[]
["For internal use only."]
["All master instruments and  fluids are calibrated and/or certified to standards which are traceable to NIST.",null,null,null,null,null,null,null,null,null,null,null,"Instrument Certificates of Calibration attached"]
["         Fluid Thermometer: ",null,null,null,"704",null,"Model #:",{"$f":"Table_Query_from_MasterLog[Model]","v":"4000,90080-09"},"Calibration Date:  ",null,{"$f":"DATEVALUE(Table_Query_from_MasterLog[CalDate])","v":"2024-05-08"},null,null,"Calibration Due: ",null,{"$f":"DATEVALUE(Sheet4!F2)","v":"2025-05-08"},null,null,"Serial No:",{"$f":"Sheet4!B2","v":"221540132"}]
[]
["         Tachometer: ",null,null,null,"117",null,"Model #:",{"$f":"Table_ExternalData_1[Model]","v":"461920"},"Calibration Date:  ",null,{"$f":"DATEVALUE(Sheet4!E6)","v":"2023-09-13"},null,null,"Calibration Due:  ",null,{"$f":"DATEVALUE(Sheet4!F6)","v":"2024-09-13"},null,null,"Serial No:",{"$f":"Sheet4!B6","v":"10055320"}]
[]
[" Ambient Monitor: ",null,null,null,"345",null,"Model #:",{"$f":"Table_ExternalData_2[Model]","v":"RH300"},"Calibration Date:  ",null,{"$f":"DATEVALUE(Sheet4!E10)","v":"2023-08-10"},null,null,"Calibration Due:  ",null,{"$f":"DATEVALUE(Sheet4!F10)","v":"2024-08-10"},null,null,"Serial No:",{"$f":"Sheet4!B10","v":"Z395285"}]
[]
[null,"Ambient Conditions"]
[null,null,null,"Room Temperature:",null,74.3,null,null,null,"Relative Humidity:",null,47.2]
[]
[]
["Revised 4/4/2023"]

{"sheet":"Sheet2","index":1,"n_rows":32,"n_cols":21,"rows_kept":32,"cut":false,"hidden":true,"merged":[]}
[]
[]
[]
[]
[]
["bob","k2","k3","100*k2/k3"]
["B1",1.323E-2,1.7022999999999999,{"$f":"100*B7/C7","v":0.77718381013922344},null,null,null,null,null,null,null,null,null,null,null,null,null,"Standard:",{"$f":"IF(AND(Sheet1!D12=\"B1\",Sheet1!G12=\"F1\"),\"Yes\",\"No\")","v":"Yes"}]
["B2",2.6100000000000002E-2,0.377,{"$f":"100*B8/C8","v":6.9230769230769242},null,"100*k2/k3=",{"$f":"VLOOKUP(Sheet1!D12,Sheet2!A6:D11,4,FALSE)","v":0.77718381013922344}]
["B3",5.2900000000000003E-2,0.26800000000000002,{"$f":"100*B9/C9","v":19.738805970149254},null,"k1=",{"$f":"VLOOKUP(Sheet1!G12,Sheet2!A14:B21,2,FALSE)","v":386}]
["B4",0.106,0.26800000000000002,{"$f":"100*B10/C10","v":39.552238805970148},null,null,null,null,null,null,null,null,null,null,null,null,null,"Fluid 1","Pass/Fail","Fluid 2","Pass/Faill"]
["B5",1.54E-2,0.85029999999999994,{"$f":"100*B11/C11","v":1.8111254851228979},null,null,null,null,null,null,null,null,null,null,null,null,"600 rpm",{"$f":"Sheet1!I28","v":0.42598409638296175},{"$f":"IF(R11=\"\",\"\",IF(S7=\"Yes\",IF(ISERR(IF(ABS(R11)<=$L$16,\"Pass\",\"Fail\")),\"\",IF(ABS(R11)<=$L$16,\"Pass\",\"Fail\")),\"Pass\"))","v":"Pass"},{"$f":"Sheet1!I29","v":-0.27183329506068787},{"$f":"IF(T11=\"\",\"\",IF(S7=\"Yes\",IF(ISERR(IF(ABS(T11)<=$L$16,\"Pass\",\"Fail\")),\"\",IF(ABS(T11)<=$L$16,\"Pass\",\"Fail\")),\"Pass\"))","v":"Pass"}]
[null,null,null,null,null,null,null,null,null,null,null,null,null,null,null,null,"300 rpm",{"$f":"Sheet1!M28","v":-0.10000000000000853},{"$f":"IF(ISERR(IF(ABS(R12)<=$L$16,\"Pass\",\"Fail\")),\"\",IF(ABS(R12)<=$L$16,\"Pass\",\"Fail\"))","v":"Pass"},{"$f":"Sheet1!M29","v":-0.20000000000000284},"Pass"]
["Spring","k1",null,null,null,null,null,null,null,null,null,null,null,null,null,null,"200 rpm",{"$f":"Sheet1!Q28","v":0.39281229206473256},"Pass",{"$f":"Sheet1!Q29","v":-5.3538733508005976E-2},{"$f":"IF(ISERR(IF(ABS(T13)<=$L$16,\"Pass\",\"Fail\")),\"\",IF(ABS(T13)<=$L$16,\"Pass\",\"Fail\"))","v":"Pass"}]
["F0.2",77.2,null,null,null,null,null,null,null,null,null,null,null,null,null,null,"100 rpm",{"$f":"Sheet1!U28","v":0.10975097509751208},"Pass",{"$f":"Sheet1!U29","v":0.10483048304831044},{"$f":"IF(ISERR(IF(ABS(T14)<=$L$16,\"Pass\",\"Fail\")),\"\",IF(ABS(T14)<=$L$16,\"Pass\",\"Fail\"))","v":"Pass"}]
["F0.5",193,null,null,null,null,{"$f":"G8*G9/600","v":0.49998825118956708},null,null,{"$f":"G15*2/1.98","v":0.50503863756521927},null,null,null,null,null,null,null,null,{"$f":"IF(COUNTIF(S11:S14,\"Pass\")=4,\"Pass\",IF(COUNTIF(S11:S14,\"Fail\")>0,\"Fail\",\"\"))","v":"Pass"},null,{"$f":"IF(COUNTIF(U11:U14,\"Pass\")=4,\"Pass\",IF(COUNTIF(U11:U14,\"Fail\")>0,\"Fail\",\"\"))","v":"Pass"}]
["F1",386,null,null,null,null,{"$f":"G8*G9/300","v":0.99997650237913416},null,null,{"$f":"G16","v":0.99997650237913416},null,{"$f":"ROUND((1.5*G16),2)","v":1.5},{"$f":"\"±\"&TEXT((1.5*G16),\"#.00\")","v":"±1.50"}]
["F2",772,null,null,null,null,{"$f":"1/(G8*G9/200)","v":0.66668233211534467},null,null,{"$f":"G17","v":0.66668233211534467}]
["F3",1158,null,null,null,null,{"$f":"1/(G8*G9/100)","v":0.33334116605767233},null,null,{"$f":"G18","v":0.33334116605767233},null,null,null,null,null,null,"as found"]
["F4",1544,null,null,null,null,null,null,null,{"$f":"FIXED(J15,4)","v":"0.5050"},null,{"$f":"\"600 VIS:  600 Reading * \"&J19","v":"600 VIS:  600 Reading * 0.5050"},null,null,null,null,null,"Fluid 1","Pass/Fail","Fluid 2","Pass/Faill"]
["F5",1930,null,null,null,null,2.3303147908581288,null,null,{"$f":"FIXED(J16,4)","v":"1.0000"},null,{"$f":"\"300 VIS:  300  Reading * \"&J20","v":"300 VIS:  300  Reading * 1.0000"},null,null,null,null,"600 rpm",{"$f":"Sheet1!I21","v":""},{"$f":"IF(R20=\"\",\"\",IF(S16=\"Yes\",IF(ISERR(IF(ABS(R20)<=$L$16,\"Pass\",\"Fail\")),\"\",IF(ABS(R20)<=$L$16,\"Pass\",\"Fail\")),\"Pass\"))","v":""},{"$f":"Sheet1!I22","v":""},{"$f":"IF(T20=\"\",\"\",IF(S16=\"Yes\",IF(ISERR(IF(ABS(T20)<=$L$16,\"Pass\",\"Fail\")),\"\",IF(ABS(T20)<=$L$16,\"Pass\",\"Fail\")),\"Pass\"))","v":""}]
["F10",3860,null,null,null,null,null,null,null,{"$f":"FIXED(J17,4)","v":"0.6667"},null,{"$f":"\"200 VIS:  200 Reading / \"&J21","v":"200 VIS:  200 Reading / 0.6667"},null,null,null,null,"300 rpm",{"$f":"Sheet1!M21","v":""},{"$f":"IF(ISERR(IF(ABS(R21)<=$L$16,\"Pass\",\"Fail\")),\"\",IF(ABS(R21)<=$L$16,\"Pass\",\"Fail\"))","v":""},{"$f":"Sheet1!M22","v":""},{"$f":"IF(ISERR(IF(ABS(T21)<=$L$16,\"Pass\",\"Fail\")),\"\",IF(ABS(T21)<=$L$16,\"Pass\",\"Fail\"))","v":""}]
[null,null,null,null,null,null,null,null,null,{"$f":"FIXED(J18,4)","v":"0.3333"},null,{"$f":"\"100 VIS: 100 Reading / \"&J22","v":"100 VIS: 100 Reading / 0.3333"},null,null,null,null,"200 rpm",{"$f":"Sheet1!Q21","v":""},"",{"$f":"Sheet1!Q22","v":""},""]
[null,null,null,null,null,null,null,null,null,null,null,null,null,null,null,null,"100 rpm",{"$f":"Sheet1!U21","v":""},"",{"$f":"Sheet1!U22","v":""},""]
[null,null,null,null,null,null,null,null,null,null,null,null,null,null,null,null,null,null,{"$f":"IF(COUNTIF(S20:S23,\"Pass\")=4,\"Pass\",IF(COUNTIF(S20:S23,\"Fail\")>0,\"Fail\",\"\"))","v":""},null,{"$f":"IF(COUNTIF(U20:U23,\"Pass\")=4,\"Pass\",IF(COUNTIF(U20:U23,\"Fail\")>0,\"Fail\",\"\"))","v":""}]
[]
[null,null,null,null,null,"1000 cP","500 cP","200 cP","100 cP","50 cP","20 cP"]
[null,null,null,null,null,"500 cP","200 cP","100 cP","50 cP","20 cP","10 cP"]
[]
[]
[]
[null,null,null,null,null,null,{"$f":"IF(J16>7,F26,IF(J16>3.5,G26,IF(J16>1.4,H26,IF(J16>0.7,I26,IF(J16>0.35,J26,K26)))))","v":"100 cP"}]
[null,null,null,null,null,null,{"$f":"IF(J16>7,F27,IF(J16>3.5,G27,IF(J16>1.4,H27,IF(J16>0.7,I27,IF(J16>0.35,J27,K27)))))","v":"50 cP"}]

{"sheet":"Sheet3","index":2,"n_rows":26,"n_cols":14,"rows_kept":26,"cut":false,"hidden":true,"merged":[]}
["130-10","Model 800 Viscometer"]
["130-10-C","Model 800 Viscometer, Complete"]
["130-10-C-H","Model 800 Viscometer, Hastelloy"]
["130-10-L","Model 800 Viscometer with Retractable Legs"]
["130-10-99","Model 800 Viscometer, Reconditioned"]
["130-60","6-Speed Viscometer"]
["130-60-99","6-Speed Viscometer, Reconditioned",null,"rpm","b1 100","b1 200","b5 100","b5 200"]
["130-76","Model 900 Viscometer",null,50,17.2,34.5,7.5,15.5]
["130-76-C","Model 900 Viscometer, Complete, 115 Volt",null,100,34.200000000000003,69.099999999999994,15,31]
["130-76-1-C","Model 900 Viscometer, Complete, 230 Volt",null,150,51.3,103.9,22.4,46.5]
["130-76-H-C","Model 900 Viscometer, Hastelloy, 115 Volt",null,200,68.099999999999994,138.19999999999999,29.8,61.9]
["130-76-1-H-C","Model 900 Viscometer, Hastelloy, 230 Volt",null,250,85.1,172.4,37.200000000000003,77.2,null,null,"rpm","b1 100","b5 100","b5 200"]
["130-76-K","Model 900 Viscometer with KlikLok Bob, 115 Volt",null,300,101.9,206.5,44.6,92.5,null,null,300,101.9,44.6,92.5]
["130-76-1-K-C","Model 900 Viscometer with KlikLok Bob, 230 Volt",null,350,118.5,240.6,51.7,107.8,null,null,350,118.5,51.7,107.8]
["130-76-LSK","Model 900 LS Conversion Kit",null,400,134.80000000000001,274.10000000000002,58.9,122.4,null,null,400,134.80000000000001,58.9,122.4]
["130-76-99","Model 900 Viscometer (Reconditioned)",null,450,151.30000000000001,305.5,66.099999999999994,136.9,null,null,450,151.30000000000001,66.099999999999994,136.9]
["130-76-600","Model 900 Viscometer with No Legs or Base",null,500,167.8,337.8,73.2,151.5,null,null,500,167.8,73.2,151.5]
["Other","Other",null,550,184.1,341.8,80.2,165.8,null,null,550,184.1,80.2,165.8]
["130-60-12","12 Speed Viscometer, 60 Hz",null,600,200.1,341.8,87.3,180.1,null,null,600,200.1,87.3,180.1]
["130-70-12","12 Speed Viscometer, 50 Hz"]
["900-02807","Model 900 Viscometer less Heat Cup"]
["130-10-C-S","Model 800 Viscometer , Complete, Stability Motor"]
["130-10-S","Model 800 Viscometer, Stability Motor"]
["130-10-L-S","Model 800 Viscometer,Retractable Legs,Stability Motor"]
["130-10-B","Model 800, Brookfield Model"]
["130-11-C","Model 800 Viscometer , Complete, Stability Motor"]

{"sheet":"Sheet4","index":3,"n_rows":39,"n_cols":6,"rows_kept":39,"cut":false,"hidden":true,"merged":[]}
["AliasID","SerialNumber","Description","Model","CalDate","DueDate"]
[704,"221540132","Digital Thermometer","4000,90080-09","2024-05-08","2025-05-08"]
[]
[]
["AliasID","SerialNumber","Description","Model","CalDate","DueDate"]
[117,"10055320","Tachometer, Laser Photo","461920","2023-09-13","2024-09-13"]
[]
[]
["AliasID","SerialNumber","Description","Model","CalDate","DueDate"]
[345,"Z395285","Thermometer / Hydrometer","RH300","2023-08-10","2024-08-10"]
[]
[]
[]
["130-10"]
["130-10-B"]
["130-10-S"]
["130-10-C"]
["130-10-C-S"]
["130-10-C-H"]
["130-10-L"]
["130-10-L-S"]
["130-10-99"]
["130-11-C"]
["130-60"]
["130-60-99"]
["130-60-12"]
["130-70-12"]
["130-70-99"]
["130-76"]
["130-76-C"]
["130-76-1-C"]
["130-76-H-C"]
["130-76-1-H-C"]
["130-76-K"]
["130-76-1-K-C"]
["130-76-LSK"]
["130-76-99"]
["130-76-600"]
["900-02807"]